theatrical-stage-ontology
type: Ontology
comment: An ontology describing types of theatrical stages, their components, and suitable applications for event planning and BIM integration.

hasLoadRating
type: DatatypeProperty
domain: Stage
range: integer
comment: Load capacity in pounds per square foot (lbs/ft²).